Part of Slepp's ProjectsPastebinTURLImagebinFilebin
Feedback -- English French German Japanese
Create Upload Newest Tools Donate
Sign In | Create Account

Miscellany
Monday, December 31st, 2007 at 12:56:26pm UTC 

  1. AR+RANLIB libpluginbitmapsnative.a
  2. MAKE in plugins/bitmaps/mono
  3. make[3]: Nothing to be done for `all'.
  4. MAKE in plugins/bitmaps/native
  5. make[3]: Nothing to be done for `all'.
  6. CC test_viewports.c
  7. test_viewports.c:252: error: redefinition of ‘__header’
  8. test_viewports.c:22: error: previous definition of ‘__header’ was here
  9. test_viewports.c:256: error: redefinition of ‘vp0’
  10. test_viewports.c:26: error: previous definition of ‘vp0’ was here
  11. test_viewports.c:277: error: redefinition of ‘vp1’
  12. test_viewports.c:47: error: previous definition of ‘vp1’ was here
  13. test_viewports.c:298: error: redefinition of ‘vp2’
  14. test_viewports.c:68: error: previous definition of ‘vp2’ was here
  15. test_viewports.c:320: error: redefinition of ‘vp3’
  16. test_viewports.c:90: error: previous definition of ‘vp3’ was here
  17. test_viewports.c:379: error: redefinition of ‘plugin_start’
  18. test_viewports.c:149: error: previous definition of ‘plugin_start’ was here
  19. test_viewports.c:482: error: redefinition of ‘__header’
  20. test_viewports.c:22: error: previous definition of ‘__header’ was here
  21. test_viewports.c:486: error: redefinition of ‘vp0’
  22. test_viewports.c:256: error: previous definition of ‘vp0’ was here
  23. test_viewports.c:507: error: redefinition of ‘vp1’
  24. test_viewports.c:277: error: previous definition of ‘vp1’ was here
  25. test_viewports.c:528: error: redefinition of ‘vp2’
  26. test_viewports.c:298: error: previous definition of ‘vp2’ was here
  27. test_viewports.c:550: error: redefinition of ‘vp3’
  28. test_viewports.c:320: error: previous definition of ‘vp3’ was here
  29. test_viewports.c:609: error: redefinition of ‘plugin_start’
  30. test_viewports.c:149: error: previous definition of ‘plugin_start’ was here
  31. test_viewports.c:712: error: redefinition of ‘__header’
  32. test_viewports.c:22: error: previous definition of ‘__header’ was here
  33. test_viewports.c:716: error: redefinition of ‘vp0’
  34. test_viewports.c:486: error: previous definition of ‘vp0’ was here
  35. test_viewports.c:737: error: redefinition of ‘vp1’
  36. test_viewports.c:507: error: previous definition of ‘vp1’ was here
  37. test_viewports.c:758: error: redefinition of ‘vp2’
  38. test_viewports.c:528: error: previous definition of ‘vp2’ was here
  39. test_viewports.c:780: error: redefinition of ‘vp3’
  40. test_viewports.c:550: error: previous definition of ‘vp3’ was here
  41. test_viewports.c:839: error: redefinition of ‘plugin_start’
  42. test_viewports.c:149: error: previous definition of ‘plugin_start’ was here
  43. test_viewports.c:942: error: redefinition of ‘__header’
  44. test_viewports.c:22: error: previous definition of ‘__header’ was here
  45. test_viewports.c:946: error: redefinition of ‘vp0’
  46. test_viewports.c:716: error: previous definition of ‘vp0’ was here
  47. test_viewports.c:967: error: redefinition of ‘vp1’
  48. test_viewports.c:737: error: previous definition of ‘vp1’ was here
  49. test_viewports.c:988: error: redefinition of ‘vp2’
  50. test_viewports.c:758: error: previous definition of ‘vp2’ was here
  51. test_viewports.c:1010: error: redefinition of ‘vp3’
  52. test_viewports.c:780: error: previous definition of ‘vp3’ was here
  53. test_viewports.c:1069: error: redefinition of ‘plugin_start’
  54. test_viewports.c:149: error: previous definition of ‘plugin_start’ was here
  55. make[2]: *** [/home/alex/rockbox/build-gb-viewports/apps/plugins/test_viewports.o] Error 1
  56. make[1]: *** [rocks] Error 2
  57. make: *** [build] Error 2

Update the Post

Either update this post and resubmit it with changes, or make a new post.

You may also comment on this post.

update paste below
details of the post (optional)

Note: Only the paste content is required, though the following information can be useful to others.

Save name / title?

(space separated, optional)



Please note that information posted here will expire by default in one month. If you do not want it to expire, please set the expiry time above. If it is set to expire, web search engines will not be allowed to index it prior to it expiring. Items that are not marked to expire will be indexable by search engines. Be careful with your passwords. All illegal activities will be reported and any information will be handed over to the authorities, so be good.

comments powered by Disqus
worth-right